BDBM50382755 CHEMBL2024171
SMILES Cc1cc(CC(CC(=O)N2CCC(CC2)N2Cc3cccc(F)c3NC2=O)c2ccccn2)cc2cn[nH]c12
InChI Key InChIKey=SGXAQLSYIHWZKV-UHFFFAOYSA-N
Data  2 IC50
  Tab Delimited (TSV)   2D SDfile   Computed 3D by Vconf -m prep SDfile
Find this compound or compounds like it in BindingDB:
Activity Spreadsheet -- Enzyme Inhibition Constant Data from BindingDB
Found 2 hits for monomerid = 50382755
TargetCalcitonin gene-related peptide type 1 receptor(Homo sapiens (Human))
Bristol-Myers Squibb Research & Development
Curated by ChEMBL
LigandPNGBDBM50382755(CHEMBL2024171)
Affinity DataIC50:  20nM. Assay description: Antagonist activity at CGRP receptor in human SK-N-MC cells assessed as inhibition of CGRP-stimulated cAMP production
In DepthDetails ArticlePubMed
TargetCalcitonin gene-related peptide type 1 receptor(Homo sapiens (Human))
Bristol-Myers Squibb Research & Development
Curated by ChEMBL
LigandPNGBDBM50382755(CHEMBL2024171)
Affinity DataIC50:  35nM. Assay description: Displacement of [I125]CGRP from CGRP receptor in human SK-N-MC cell membrane after 2 hrs by gamma or scintillation counting
In DepthDetails ArticlePubMed