BDBM50382834 CHEMBL2021978
SMILES Clc1ccc(Cl)c(NC(=O)NS(=O)(=O)c2ccc(OCCCCN3CCCCC3)cc2)c1
InChI Key InChIKey=YSUYYUNXJLWLFZ-UHFFFAOYSA-N
Data  2 IC50
  Tab Delimited (TSV)   2D SDfile   Computed 3D by Vconf -m prep SDfile
Find this compound or compounds like it in BindingDB:
Activity Spreadsheet -- Enzyme Inhibition Constant Data from BindingDB
Found 2 hits for monomerid = 50382834
TargetPotassium voltage-gated channel subfamily H member 2(Homo sapiens (Human))
Universidad De Navarra
Curated by ChEMBL
LigandPNGBDBM50382834(CHEMBL2021978)
Affinity DataIC50: >1.00E+5nM. Assay description: Displacement of [3H] dofetilide from human ERG channel expressed in HEK293 cells after 45 mins by scintillation counting method
In DepthDetails ArticlePubMed
TargetHistamine H3 receptor(Homo sapiens (Human))
Universidad De Navarra
Curated by ChEMBL
LigandPNGBDBM50382834(CHEMBL2021978)
Affinity DataIC50:  1.32E+4nM. Assay description: Displacement of [125H]iodoproxyphan from human histamine H3 receptor expressed in CHO-K1 cells
In DepthDetails ArticlePubMed