BDBM50382889 CHEMBL2024193
SMILES Cc1nc(C2CCN(CC2)C(=O)[C@@H]2CNC[C@H]2c2ccc(F)cc2F)n(n1)-c1ccc(F)c(Cl)c1
InChI Key InChIKey=FHXBOCMGLGSFAE-VQTJNVASSA-N
Data  2 IC50
  Tab Delimited (TSV)   2D SDfile   Computed 3D by Vconf -m prep SDfile
Find this compound or compounds like it in BindingDB:
Activity Spreadsheet -- Enzyme Inhibition Constant Data from BindingDB
Found 2 hits for monomerid = 50382889
TargetLysosomal Pro-X carboxypeptidase(Mus musculus)
Merck Research Laboratories
Curated by ChEMBL
LigandPNGBDBM50382889(CHEMBL2024193)
Affinity DataIC50:  32nM. Assay description: Inhibition of mouse PrCP
In DepthDetails ArticlePubMed
TargetLysosomal Pro-X carboxypeptidase(Homo sapiens (Human))
Merck Research Laboratories
Curated by ChEMBL
LigandPNGBDBM50382889(CHEMBL2024193)
Affinity DataIC50:  13nM. Assay description: Inhibition of human PrCP
In DepthDetails ArticlePubMed