BDBM50382922 CHEMBL2024197
SMILES Fc1ccc([C@@H]2CNC[C@H]2C(=O)N2CCC(CC2)c2ccnn2-c2ccc(F)c(Cl)c2)c(F)c1
InChI Key InChIKey=SULPIHMQQYIXCW-VQTJNVASSA-N
Data  2 IC50
  Tab Delimited (TSV)   2D SDfile   Computed 3D by Vconf -m prep SDfile
Find this compound or compounds like it in BindingDB:
Activity Spreadsheet -- Enzyme Inhibition Constant Data from BindingDB
Found 2 hits for monomerid = 50382922
TargetLysosomal Pro-X carboxypeptidase(Mus musculus)
Merck Research Laboratories
Curated by ChEMBL
LigandPNGBDBM50382922(CHEMBL2024197)
Affinity DataIC50:  3.70nM. Assay description: Inhibition of mouse PrCP
In DepthDetails ArticlePubMed
TargetLysosomal Pro-X carboxypeptidase(Homo sapiens (Human))
Merck Research Laboratories
Curated by ChEMBL
LigandPNGBDBM50382922(CHEMBL2024197)
Affinity DataIC50:  2.5nM. Assay description: Inhibition of human PrCP
In DepthDetails ArticlePubMed