BDBM50382943 CHEMBL2029421
SMILES O[C@]1(CC[C@@H](CC1)N[C@H]1CCN(C1)C(=O)CNC(=O)c1cccc(c1)C(F)(F)F)c1ccc(cn1)-c1cnccn1
InChI Key InChIKey=AYMVUOQELHPZJV-LXWOLXCRSA-N
Data  4 IC50
  Tab Delimited (TSV)   2D SDfile   Computed 3D by Vconf -m prep SDfile
Find this compound or compounds like it in BindingDB:
Activity Spreadsheet -- Enzyme Inhibition Constant Data from BindingDB
Found 4 hits for monomerid = 50382943
TargetPotassium voltage-gated channel subfamily H member 2(Homo sapiens (Human))
TBA
Curated by ChEMBL
LigandPNGBDBM50382943(CHEMBL2029421)
Affinity DataIC50: >3.00E+4nM. Assay description: Displacement of [3H]dofetilide from human ERG
In DepthDetails ArticlePubMed
TargetC-C chemokine receptor type 2(Homo sapiens (Human))
TBA
Curated by ChEMBL
LigandPNGBDBM50382943(CHEMBL2029421)
Affinity DataIC50:  6nM. Assay description: Displacement of [125I]MCP1 from human CCR2 in PBMC after 30 mins by gamma counting
In DepthDetails ArticlePubMed
TargetC-C chemokine receptor type 2(Homo sapiens (Human))
TBA
Curated by ChEMBL
LigandPNGBDBM50382943(CHEMBL2029421)
Affinity DataIC50:  3.80nM. Assay description: Antagonist activity at CCR2 receptor in human PBMC assessed as inhibition of MCP1-mediated leukocyte chemotaxis after 30 mins by microscopy
In DepthDetails ArticlePubMed
TargetC-C chemokine receptor type 2(Homo sapiens (Human))
TBA
Curated by ChEMBL
LigandPNGBDBM50382943(CHEMBL2029421)
Affinity DataIC50:  6.5nM. Assay description: Antagonist activity at CCR2 receptor in human whole blood assessed as inhibition of alexa-tagged MCP-induced effect 30 mins by flow cytometry
In DepthDetails ArticlePubMed