BDBM50382990 CHEMBL1800358
SMILES CN1CCN(CC1)C(=O)c1cccc(c1)-c1nc(N)nc(n1)-c1ccccc1O
InChI Key InChIKey=SENKKHIKGQSFKC-UHFFFAOYSA-N
Data  2 KI
  Tab Delimited (TSV)   2D SDfile   Computed 3D by Vconf -m prep SDfile
Find this compound or compounds like it in BindingDB:
Activity Spreadsheet -- Enzyme Inhibition Constant Data from BindingDB
Found 2 hits for monomerid = 50382990
TargetAdenosine receptor A2a(Homo sapiens (Human))
Heptares Therapeutics
Curated by ChEMBL
LigandPNGBDBM50382990(CHEMBL1800358)
Affinity DataKi:  1nM. Assay description: Displacement of [3H]ZM241385 from stabilized human adenosine receptor A2a expressed in HEK293 cells followed by receptor capturing on Biocore chips b...
In DepthDetails ArticlePubMed
TargetAdenosine receptor A2a(Homo sapiens (Human))
Heptares Therapeutics
Curated by ChEMBL
LigandPNGBDBM50382990(CHEMBL1800358)
Affinity DataKi:  1.02nM. Assay description: Displacement of [3H]ZM241385 from human A2A receptor expressed in HEK293 cells after 1 hr by liquid scintillation counting
In DepthDetails ArticlePubMed