BDBM50383042 CHEMBL2031295
SMILES COc1cc(cc(OC)c1OC)C(=O)NC(N)=Nc1ccc(Cl)c(c1)C(=O)Nc1ccccc1
InChI Key InChIKey=BZLYWEGZFZTCMX-UHFFFAOYSA-N
Data  1 IC50
  Tab Delimited (TSV)   2D SDfile   Computed 3D by Vconf -m prep SDfile
Find this compound or compounds like it in BindingDB:
Activity Spreadsheet -- Enzyme Inhibition Constant Data from BindingDB
Found 1 hit for monomerid = 50383042
TargetSmoothened homolog(Homo sapiens (Human))
Universit£
Curated by ChEMBL
LigandPNGBDBM50383042(CHEMBL2031295)
Affinity DataIC50:  160nM. Assay description: Inhibition of Smo-mediated Hh signaling in human Shh-light2 cells by luciferase reporter gene assay
In DepthDetails ArticlePubMed