BDBM50383098 CHEMBL2031718
SMILES O=C(Nc1ccc2cc(CN3CCCC3)cnc2c1)c1ccc(nc1)-c1ccccc1
InChI Key InChIKey=PMXRYNHUXSHQES-UHFFFAOYSA-N
Data  1 IC50
  Tab Delimited (TSV)   2D SDfile   Computed 3D by Vconf -m prep SDfile
Find this compound or compounds like it in BindingDB:
Activity Spreadsheet -- Enzyme Inhibition Constant Data from BindingDB
Found 1 hit for monomerid = 50383098
TargetMelanin-concentrating hormone receptor 1(Homo sapiens (Human))
Takeda Pharmaceutical
Curated by ChEMBL
LigandPNGBDBM50383098(CHEMBL2031718)
Affinity DataIC50:  73nM. Assay description: Displacement of [125I]MCH from human MCHR1 expressed in CHO cells after 1 hr by scintillation counting
In DepthDetails ArticlePubMed