BDBM50383247 CHEMBL2032193
SMILES Fc1ccc(NC(=O)N2CCc3sccc3C2c2ccc(cc2)C(F)(F)F)cc1
InChI Key InChIKey=WYNBWGVBDVSVCT-UHFFFAOYSA-N
Data  1 IC50
  Tab Delimited (TSV)   2D SDfile   Computed 3D by Vconf -m prep SDfile
Find this compound or compounds like it in BindingDB:
Activity Spreadsheet -- Enzyme Inhibition Constant Data from BindingDB
Found 1 hit for monomerid = 50383247
TargetTransient receptor potential cation channel subfamily M member 8(Rattus norvegicus (Rat))
Amgen
Curated by ChEMBL
LigandPNGBDBM50383247(CHEMBL2032193)
Affinity DataIC50:  340nM. Assay description: Antagonist activity at rat TRPM8 expressed in CHO cells assessed as inhibition of icilin-induced Ca2+ influx incubated 2.5 mins prior icilin inductio...
In DepthDetails ArticlePubMed