BDBM50383298 CHEMBL2029608
SMILES [#7]\[#6](-[#7])=[#7]\[#6]-[#6]-[#6]-[#6@@H]-1-[#7]-[#6](=O)-[#6@@H](-[#6]-[#6]-[#6]\[#7]=[#6](\[#7])-[#7])\[#6]=[#6]\[#6@@H](-[#6]-c2ccc(-[#8])cc2)-[#7]-[#6](=O)-[#6]-[#7]-[#6](=O)-[#6@H](-[#6]-c2ccc3ccccc3c2)-[#7]-[#6]-1=O
InChI Key InChIKey=AUERTOWQSJBPPO-SGMIOLMCSA-N
Data  1 IC50
  Tab Delimited (TSV)   2D SDfile   Computed 3D by Vconf -m prep SDfile
Find this compound or compounds like it in BindingDB:
Activity Spreadsheet -- Enzyme Inhibition Constant Data from BindingDB
Found 1 hit for monomerid = 50383298
TargetC-X-C chemokine receptor type 4(Homo sapiens (Human))
Kyoto University
Curated by ChEMBL
LigandPNGBDBM50383298(CHEMBL2029608)
Affinity DataIC50:  330nM. Assay description: Displacement of [125I]SDF-1alpha from CXCR4 expressed in HEK293 cell membrane after 1 hr
In DepthDetails ArticlePubMed