BDBM50383321 CHEMBL2029780
SMILES O[C@@H]1CN[C@H](CCSCCc2ccccc2)[C@H](O)[C@H]1O
InChI Key InChIKey=DRTZJXVKUAQCDX-KBXIAJHMSA-N
Data  1 KI
  Tab Delimited (TSV)   2D SDfile   Computed 3D by Vconf -m prep SDfile
Find this compound or compounds like it in BindingDB:
Activity Spreadsheet -- Enzyme Inhibition Constant Data from BindingDB
Found 1 hit for monomerid = 50383321
TargetLysosomal acid glucosylceramidase(Homo sapiens (Human))
University Of British Columbia
Curated by ChEMBL
LigandPNGBDBM50383321(CHEMBL2029780)
Affinity DataKi:  3nMpH: 5.0Assay Description:Competitive inhibition of wild type human glucocerebrosidase using 4-methylumbelliferyl beta-D-glucopyranoside as substrate after 15 mins by Dixon an...
In DepthDetails ArticlePubMed