BDBM50383326 CHEMBL2029775
SMILES CC(C)(C)SCC[C@H]1NC[C@@H](O)[C@H](O)[C@H]1O
InChI Key InChIKey=CNBLYVDBIFJWSJ-IMSYWVGJSA-N
Data  1 KI
  Tab Delimited (TSV)   2D SDfile   Computed 3D by Vconf -m prep SDfile
Find this compound or compounds like it in BindingDB:
Activity Spreadsheet -- Enzyme Inhibition Constant Data from BindingDB
Found 1 hit for monomerid = 50383326
TargetLysosomal acid glucosylceramidase(Homo sapiens (Human))
University Of British Columbia
Curated by ChEMBL
LigandPNGBDBM50383326(CHEMBL2029775)
Affinity DataKi:  29nMpH: 5.0Assay Description:Competitive inhibition of wild type human glucocerebrosidase using 2,4-dinitrophenyl beta-D-glucopyranoside as substrate after 3 mins by Dixon and Li...
In DepthDetails ArticlePubMed