BDBM50383565 CHEMBL2032396
SMILES Cc1noc(C)c1-c1ccc(\C=C\C(=O)NO)c(Cl)c1
InChI Key InChIKey=ISIYPXHNZZIKMU-AATRIKPKSA-N
Data  1 IC50
  Tab Delimited (TSV)   2D SDfile   Computed 3D by Vconf -m prep SDfile
Find this compound or compounds like it in BindingDB:
Activity Spreadsheet -- Enzyme Inhibition Constant Data from BindingDB
Found 1 hit for monomerid = 50383565
TargetBotulinum neurotoxin type A(Clostridium botulinum)
Fox Chase Chemical Diversity Center
Curated by ChEMBL
LigandPNGBDBM50383565(CHEMBL2032396)
Affinity DataIC50:  1.16E+3nM. Assay description: Inhibition of clostridium botulinum Botulinum neurotoxin type A using SNAPide as substrate by FRET analysis
In DepthDetails ArticlePubMed