BDBM50383570 CHEMBL2029492
SMILES CC(C)OC(=O)N1[C@H](C)C[C@H](N(Cc2cc(cc(c2)C(F)(F)F)C(F)(F)F)c2nnn(CCN3CC3)n2)c2cc(ccc12)C(F)(F)F
InChI Key InChIKey=FXHUEGJXMWWRKL-OSPHWJPCSA-N
Data  1 IC50
  Tab Delimited (TSV)   2D SDfile   Computed 3D by Vconf -m prep SDfile
Find this compound or compounds like it in BindingDB:
Activity Spreadsheet -- Enzyme Inhibition Constant Data from BindingDB
Found 1 hit for monomerid = 50383570
TargetCholesteryl ester transfer protein(Homo sapiens (Human))
Eli Lilly
Curated by ChEMBL
LigandPNGBDBM50383570(CHEMBL2029492)
Affinity DataIC50:  151nM. Assay description: Inhibition of CETP in human plasma assessed as transfer of fluorescently labelled cholesteryl ester to VLDL by fluorimetry
In DepthDetails ArticlePubMed