BDBM50383582 CHEMBL2029480
SMILES CC[C@@H]1C[C@H](N(Cc2cc(cc(c2)C(F)(F)F)C(F)(F)F)c2nnn(CC3CC3)n2)c2cc(ccc2N1C(=O)OC(C)C)C(F)(F)F
InChI Key InChIKey=FPZNXSLKZZTRTG-RDGATRHJSA-N
Data  1 IC50
  Tab Delimited (TSV)   2D SDfile   Computed 3D by Vconf -m prep SDfile
Find this compound or compounds like it in BindingDB:
Activity Spreadsheet -- Enzyme Inhibition Constant Data from BindingDB
Found 1 hit for monomerid = 50383582
TargetCholesteryl ester transfer protein(Homo sapiens (Human))
Eli Lilly
Curated by ChEMBL
LigandPNGBDBM50383582(CHEMBL2029480)
Affinity DataIC50:  61nM. Assay description: Inhibition of CETP in human plasma assessed as transfer of fluorescently labelled cholesteryl ester to VLDL by fluorimetry
In DepthDetails ArticlePubMed