BDBM50383585 CHEMBL2029477
SMILES CC[C@@H]1C[C@H](N(Cc2cc(cc(c2)C(F)(F)F)C(F)(F)F)c2nnn(n2)C(C)C)c2cc(ccc2N1C(=O)OC(C)C)C(F)(F)F
InChI Key InChIKey=KBYPREHGFGVTAQ-QPPBQGQZSA-N
Data  1 IC50
  Tab Delimited (TSV)   2D SDfile   Computed 3D by Vconf -m prep SDfile
Find this compound or compounds like it in BindingDB:
Activity Spreadsheet -- Enzyme Inhibition Constant Data from BindingDB
Found 1 hit for monomerid = 50383585
TargetCholesteryl ester transfer protein(Homo sapiens (Human))
Eli Lilly
Curated by ChEMBL
LigandPNGBDBM50383585(CHEMBL2029477)
Affinity DataIC50:  56nM. Assay description: Inhibition of CETP in human plasma assessed as transfer of fluorescently labelled cholesteryl ester to VLDL by fluorimetry
In DepthDetails ArticlePubMed