BDBM50383810 CHEMBL2030959
SMILES OC(=O)[C@H](Cc1ccc2oc(CCNc3ccccn3)cc2c1)NC(=O)c1c(Cl)cccc1Cl
InChI Key InChIKey=BYQHRPBGTMGOIJ-FQEVSTJZSA-N
Data  2 IC50
  Tab Delimited (TSV)   2D SDfile   Computed 3D by Vconf -m prep SDfile
Find this compound or compounds like it in BindingDB:
Activity Spreadsheet -- Enzyme Inhibition Constant Data from BindingDB
Found 2 hits for monomerid = 50383810
TargetIntegrin alpha-5/beta-1(Homo sapiens (Human))
Astrazeneca
Curated by ChEMBL
LigandPNGBDBM50383810(CHEMBL2030959)
Affinity DataIC50:  890nM. Assay description: Binding affinity to integrin alpha5beta1
In DepthDetails ArticlePubMed
TargetIntegrin alpha-5/beta-1(Homo sapiens (Human))
Astrazeneca
Curated by ChEMBL
LigandPNGBDBM50383810(CHEMBL2030959)
Affinity DataIC50:  4.00E+3nM. Assay description: Antagonist activity at integrin alpha5beta1 in human K562 cells assessed as inhibition of cell adhesion
In DepthDetails ArticlePubMed