BDBM50384070 CHEMBL2029518
SMILES CNc1csc2c1nc[nH]c2=O
InChI Key InChIKey=UZDKZNLKEKTXQS-UHFFFAOYSA-N
Data  1 IC50
  Tab Delimited (TSV)   2D SDfile   Computed 3D by Vconf -m prep SDfile
Find this compound or compounds like it in BindingDB:
Activity Spreadsheet -- Enzyme Inhibition Constant Data from BindingDB
Found 1 hit for monomerid = 50384070
Target3-phosphoinositide-dependent protein kinase 1(Homo sapiens (Human))
S*Bio
Curated by ChEMBL
LigandPNGBDBM50384070(CHEMBL2029518)
Affinity DataIC50:  1.54E+5nM. Assay description: Competitive inhibition of PDK1 using [gamma-33P]-ATP as substrate after 30 mins by scintillation counting
In DepthDetails ArticlePubMed