BDBM50384109 CHEMBL2029350
SMILES COc1ccc(cc1)N1C(=O)OC(C)(C)C1=O
InChI Key InChIKey=PXBWMQBSKYVHOR-UHFFFAOYSA-N
Data  1 IC50
  Tab Delimited (TSV)   2D SDfile   Computed 3D by Vconf -m prep SDfile
Find this compound or compounds like it in BindingDB:
Activity Spreadsheet -- Enzyme Inhibition Constant Data from BindingDB
Found 1 hit for monomerid = 50384109
TargetNeutrophil elastase(Homo sapiens (Human))
University Of Lisbon
Curated by ChEMBL
LigandPNGBDBM50384109(CHEMBL2029350)
Affinity DataIC50: >5.00E+5nM. Assay description: Inhibition of human neutrophil elastase using chromogenic substrate (N-MeOSuc-Ala-Ala-Pro-Val-p-nitroanilide after 120 mins
In DepthDetails ArticlePubMed