BDBM50384157 CHEMBL2029739
SMILES CN(CCCC(=O)NCC#N)C(=O)c1ccc2n(C)c3CC[C@H](Cc3c2c1)C1CCOCC1
InChI Key InChIKey=GUNCOSCOXDDNME-LJQANCHMSA-N
Data  1 IC50  1 EC50
  Tab Delimited (TSV)   2D SDfile   Computed 3D by Vconf -m prep SDfile
Find this compound or compounds like it in BindingDB:
Activity Spreadsheet -- Enzyme Inhibition Constant Data from BindingDB
Found 2 hits for monomerid = 50384157
TargetCannabinoid receptor 1(Homo sapiens (Human))
Astrazeneca
Curated by ChEMBL
LigandPNGBDBM50384157(CHEMBL2029739)
Affinity DataEC50:  70.6nM. Assay description: Agonist activity at human CB1 receptor expressed in HEK293 cells assessed as [35S]GTPgamma binding
In DepthDetails ArticlePubMed
TargetPotassium voltage-gated channel subfamily H member 2(Homo sapiens (Human))
Astrazeneca
Curated by ChEMBL
LigandPNGBDBM50384157(CHEMBL2029739)
Affinity DataIC50: >3.30E+4nM. Assay description: Inhibition of human ERG
In DepthDetails ArticlePubMed