BDBM50384280 CHEMBL2030621
SMILES Cc1ccc(NC(=O)CSc2nc(C3CCCCC3)c(C#N)c(=O)[nH]2)cc1
InChI Key InChIKey=KMTFAGZWMCRHRP-UHFFFAOYSA-N
Data  1 IC50
  Tab Delimited (TSV)   2D SDfile   Computed 3D by Vconf -m prep SDfile
Find this compound or compounds like it in BindingDB:
Activity Spreadsheet -- Enzyme Inhibition Constant Data from BindingDB
Found 1 hit for monomerid = 50384280
TargetRap guanine nucleotide exchange factor 4(Homo sapiens (Human))
University Of Texas Medical Branch
Curated by ChEMBL
LigandPNGBDBM50384280(CHEMBL2030621)
Affinity DataIC50: >3.00E+5nM. Assay description: Competitive inhibition of Epac2 using fluorescent nucleotide analog 8-NBD-cAMP by fluorescence analysis
In DepthDetails ArticlePubMed