BDBM50384397 CHEMBL2031237
SMILES CN1CCN(CC1)c1ccc2ncn(-c3cc(NC(=O)c4cncs4)ccc3C)c(=O)c2c1
InChI Key InChIKey=WCCAEYPMNBWANP-UHFFFAOYSA-N
Data  5 IC50
  Tab Delimited (TSV)   2D SDfile   Computed 3D by Vconf -m prep SDfile
Find this compound or compounds like it in BindingDB:
Activity Spreadsheet -- Enzyme Inhibition Constant Data from BindingDB
Found 5 hits for monomerid = 50384397
TargetMitogen-activated protein kinase 14(Homo sapiens (Human))
Astrazeneca
Curated by ChEMBL
LigandPNGBDBM50384397(CHEMBL2031237)
Affinity DataIC50:  730nM. Assay description: Inhibition of p38alpha-mediated TNFalpha secretion in LPS-stimulated human whole blood
In DepthDetails ArticlePubMed
TargetMitogen-activated protein kinase 14(Homo sapiens (Human))
Astrazeneca
Curated by ChEMBL
LigandPNGBDBM50384397(CHEMBL2031237)
Affinity DataIC50:  741nM. Assay description: Inhibition of p38alpha-mediated TNFalpha secretion in LPS-stimulated human whole blood
In DepthDetails ArticlePubMed
TargetMitogen-activated protein kinase 14(Homo sapiens (Human))
Astrazeneca
Curated by ChEMBL
LigandPNGBDBM50384397(CHEMBL2031237)
Affinity DataIC50:  25.7nM. Assay description: Inhibition of p38alpha kinase
In DepthDetails ArticlePubMed
TargetMitogen-activated protein kinase 14(Homo sapiens (Human))
Astrazeneca
Curated by ChEMBL
LigandPNGBDBM50384397(CHEMBL2031237)
Affinity DataIC50:  26nM. Assay description: Inhibition of p38alpha kinase
In DepthDetails ArticlePubMed
TargetMitogen-activated protein kinase 14(Homo sapiens (Human))
Astrazeneca
Curated by ChEMBL
LigandPNGBDBM50384397(CHEMBL2031237)
Affinity DataIC50:  200nM. Assay description: Inhibition of p38alpha-mediated TNFalpha secretion in LPS-stimulated human whole blood assessed as IC50 equals to free drug concentration at human wh...
In DepthDetails ArticlePubMed