BDBM50384688 CHEMBL2037106
SMILES O=C(Nc1ccccc1N1CCNCC1)c1csc(n1)-c1cn[nH]c1
InChI Key InChIKey=XUUCJKFSSKKMFG-UHFFFAOYSA-N
Data  1 IC50
  Tab Delimited (TSV)   2D SDfile   Computed 3D by Vconf -m prep SDfile
Find this compound or compounds like it in BindingDB:
Activity Spreadsheet -- Enzyme Inhibition Constant Data from BindingDB
Found 1 hit for monomerid = 50384688
TargetSerine/threonine-protein kinase Chk1(Homo sapiens (Human))
TBA
Curated by ChEMBL
LigandPNGBDBM50384688(CHEMBL2037106)
Affinity DataIC50:  190nM. Assay description: Inhibition of recombinant His-tagged CHK1 using biotin-RSGLYRSPSMPENLNRPR as substrate after 1 hr by scintillation proximity assay
In DepthDetails ArticlePubMed