BDBM50384730 CHEMBL2037216
SMILES Nc1cccc(Nc2ccc3\C(=C\c4ccc[nH]4)C(=O)Nc3c2)c1
InChI Key InChIKey=ONEJSVZJYWOQBN-YVLHZVERSA-N
Data  1 IC50
  Tab Delimited (TSV)   2D SDfile   Computed 3D by Vconf -m prep SDfile
Find this compound or compounds like it in BindingDB:
Activity Spreadsheet -- Enzyme Inhibition Constant Data from BindingDB
Found 1 hit for monomerid = 50384730
TargetNT-3 growth factor receptor(Homo sapiens (Human))
TBA
Curated by ChEMBL
LigandPNGBDBM50384730(CHEMBL2037216)
Affinity DataIC50: >1.00E+4nM. Assay description: Inhibition of TRKC by HTRF assay
In DepthDetails ArticlePubMed