BDBM50384913 CHEMBL2036501
SMILES COc1ccc2nc(C)cc(SCCC#N)c2c1
InChI Key InChIKey=XEMHMGKVTITNOD-UHFFFAOYSA-N
Data  2 KI
  Tab Delimited (TSV)   2D SDfile   Computed 3D by Vconf -m prep SDfile
Find this compound or compounds like it in BindingDB:
Activity Spreadsheet -- Enzyme Inhibition Constant Data from BindingDB
Found 2 hits for monomerid = 50384913
TargetGlycylpeptide N-tetradecanoyltransferase 2(Homo sapiens (Human))
Imperial College
Curated by ChEMBL
LigandPNGBDBM50384913(CHEMBL2036501)
Affinity DataKi: >1.00E+5nM. Assay description: Inhibition of human N-myristoyltransferase 2 using human pp60Src92-16 amino acids) as substrate
In DepthDetails ArticlePubMed
TargetGlycylpeptide N-tetradecanoyltransferase 1(Homo sapiens (Human))
Imperial College
Curated by ChEMBL
LigandPNGBDBM50384913(CHEMBL2036501)
Affinity DataKi: >1.00E+5nM. Assay description: Inhibition of human N-myristoyltransferase 1 using human pp60Src92-16 amino acids) as substrate
In DepthDetails ArticlePubMed