BDBM50384959 CHEMBL2037518
SMILES O=C(CCCN1CCC(CC1)c1ccccc1)c1nc2ccccc2s1
InChI Key InChIKey=IAMJESJLDAFTKX-UHFFFAOYSA-N
Data  6 KI
  Tab Delimited (TSV)   2D SDfile   Computed 3D by Vconf -m prep SDfile
Find this compound or compounds like it in BindingDB:
Activity Spreadsheet -- Enzyme Inhibition Constant Data from BindingDB
Found 6 hits for monomerid = 50384959
TargetD(4) dopamine receptor(RAT)
Florida A&M University
Curated by ChEMBL
LigandPNGBDBM50384959(CHEMBL2037518)
Affinity DataKi:  44.4nM. Assay description: Displacement of [3H]N-methylspiperone from rat dopamine D4 receptor by liquid scintillation counting
In DepthDetails ArticlePubMed
Target5-hydroxytryptamine receptor 1A(Homo sapiens (Human))
Florida A&M University
Curated by ChEMBL
LigandPNGBDBM50384959(CHEMBL2037518)
Affinity DataKi:  85nM. Assay description: Displacement of [3H]8-OH-DPAT from human 5HT1A receptor by liquid scintillation counting
In DepthDetails ArticlePubMed
Target5-hydroxytryptamine receptor 2A(Homo sapiens (Human))
Florida A&M University
Curated by ChEMBL
LigandPNGBDBM50384959(CHEMBL2037518)
Affinity DataKi:  287nM. Assay description: Displacement of [3H]Ketanserin from human 5HT2A receptor by liquid scintillation counting
In DepthDetails ArticlePubMed
Target5-hydroxytryptamine receptor 7(Homo sapiens (Human))
Florida A&M University
Curated by ChEMBL
LigandPNGBDBM50384959(CHEMBL2037518)
Affinity DataKi:  426nM. Assay description: Displacement of [3H]LSD from human 5HT7 receptor by liquid scintillation counting
In DepthDetails ArticlePubMed
TargetD(2) dopamine receptor(Homo sapiens (Human))
Florida A&M University
Curated by ChEMBL
LigandPNGBDBM50384959(CHEMBL2037518)
Affinity DataKi:  530nM. Assay description: Displacement of [3H]N-methylspiperone from human dopamine D2 receptor by liquid scintillation counting
In DepthDetails ArticlePubMed
TargetSodium-dependent serotonin transporter(Homo sapiens (Human))
Florida A&M University
Curated by ChEMBL
LigandPNGBDBM50384959(CHEMBL2037518)
Affinity DataKi:  706nM. Assay description: Displacement of [3H]Citalopram from human SERT by liquid scintillation counting
In DepthDetails ArticlePubMed