BDBM50385152 CHEMBL2035933
SMILES O=C(NCCc1c[nH]c2ccccc12)[C@@H]1CNC[C@@H]1C(=O)NCC(=O)c1ccccc1
InChI Key InChIKey=UOJQOWWZQUHNJY-UXHICEINSA-N
Data  1 KI
  Tab Delimited (TSV)   2D SDfile   Computed 3D by Vconf -m prep SDfile
Find this compound or compounds like it in BindingDB:
Activity Spreadsheet -- Enzyme Inhibition Constant Data from BindingDB
Found 1 hit for monomerid = 50385152
TargetMelanocortin receptor 4(Homo sapiens (Human))
Neurocrine Biosciences
Curated by ChEMBL
LigandPNGBDBM50385152(CHEMBL2035933)
Affinity DataKi:  5.50E+3nM. Assay description: Displacement of [125I]NDPMSH from human MC4 receptor expressed in HEK293 cells after 2 hrs by liquid scintillation counting
In DepthDetails ArticlePubMed