BDBM50385175 CHEMBL2036866
SMILES COc1ccc(Nc2nccc(n2)-c2nc3ccccc3n2C)cc1O
InChI Key InChIKey=YVQWJUWRPUTYMY-UHFFFAOYSA-N
Data  5 IC50
  Tab Delimited (TSV)   2D SDfile   Computed 3D by Vconf -m prep SDfile
Find this compound or compounds like it in BindingDB:
Activity Spreadsheet -- Enzyme Inhibition Constant Data from BindingDB
Found 5 hits for monomerid = 50385175
TargetAurora kinase B(Homo sapiens (Human))
Technische Universit£T Braunschweig
Curated by ChEMBL
LigandPNGBDBM50385175(CHEMBL2036866)
Affinity DataIC50:  6.00E+3nM. Assay description: Inhibition of recombinant Aurora B using tetra(LRRWSLG) as substrate assessed as inhibition of [33P]Phosphate incorporation into substrate after 80 m...
In DepthDetails ArticlePubMed
TargetSerine/threonine-protein kinase PLK1(Homo sapiens (Human))
Technische Universit£T Braunschweig
Curated by ChEMBL
LigandPNGBDBM50385175(CHEMBL2036866)
Affinity DataIC50:  1.20E+3nM. Assay description: Inhibition of recombinant PLK1 using RBERCHKtide as substrate assessed as inhibition of [33P]Phosphate incorporation into substrate after 80 mins by ...
In DepthDetails ArticlePubMed
TargetVascular endothelial growth factor receptor 2(Homo sapiens (Human))
Technische Universit£T Braunschweig
Curated by ChEMBL
LigandPNGBDBM50385175(CHEMBL2036866)
Affinity DataIC50:  7.20E+3nM. Assay description: Inhibition of recombinant VEGFR2 using poly(Glu,Tyr)4 as substrate assessed as inhibition of [33P]Phosphate incorporation into substrate after 80 min...
In DepthDetails ArticlePubMed
TargetFocal adhesion kinase 1(Homo sapiens (Human))
Technische Universit£T Braunschweig
Curated by ChEMBL
LigandPNGBDBM50385175(CHEMBL2036866)
Affinity DataIC50:  3.40E+3nM. Assay description: Inhibition of recombinant FAK using poly(Glu,Tyr)4 as substrate assessed as inhibition of [33P]Phosphate incorporation into substrate after 80 mins b...
In DepthDetails ArticlePubMed
TargetRAC-alpha serine/threonine-protein kinase(Homo sapiens (Human))
Technische Universit£T Braunschweig
Curated by ChEMBL
LigandPNGBDBM50385175(CHEMBL2036866)
Affinity DataIC50: >1.00E+5nM. Assay description: Inhibition of recombinant AKT1 using GSK3 as substrate assessed as inhibition of [33P]Phosphate incorporation into substrate after 80 mins by scintil...
In DepthDetails ArticlePubMed