BDBM50385240 CHEMBL2037466
SMILES Cc1c([nH]c2c(csc12)-c1cccnc1)C(O)=O
InChI Key InChIKey=ZESRMEYJKLCOJM-UHFFFAOYSA-N
Data  2 EC50
  Tab Delimited (TSV)   2D SDfile   Computed 3D by Vconf -m prep SDfile
Find this compound or compounds like it in BindingDB:
Activity Spreadsheet -- Enzyme Inhibition Constant Data from BindingDB
Found 2 hits for monomerid = 50385240
TargetG-protein coupled receptor 35(Homo sapiens (Human))
Corning
Curated by ChEMBL
LigandPNGBDBM50385240(CHEMBL2037466)
Affinity DataEC50:  2.69E+4nM. Assay description: Agonist activity at GPR35 in human U20S cells expressing beta-lactamase and Gal4-VP16 transcription factor assessed as beta arrestin translocation af...
In DepthDetails ArticlePubMed
TargetG-protein coupled receptor 35(Homo sapiens (Human))
Corning
Curated by ChEMBL
LigandPNGBDBM50385240(CHEMBL2037466)
Affinity DataEC50:  630nM. Assay description: Agonist activity at GPR35 in human HT-29 cells by dynamic mass redistribution assay
In DepthDetails ArticlePubMed