BDBM50385594 CHEMBL2042695
SMILES CN1c2ccc(Nc3ncc(Cl)c(N[C@@H]4[C@@H]5C[C@@H](C=C5)[C@@H]4C(N)=O)n3)cc2CCCC1=O
InChI Key InChIKey=AHLIOYKRAKANRB-BBNYVJOESA-N
Data  3 IC50
  Tab Delimited (TSV)   2D SDfile   Computed 3D by Vconf -m prep SDfile
Find this compound or compounds like it in BindingDB:
Activity Spreadsheet -- Enzyme Inhibition Constant Data from BindingDB
Found 3 hits for monomerid = 50385594
TargetALK tyrosine kinase receptor(Homo sapiens (Human))
TBA
Curated by ChEMBL
LigandPNGBDBM50385594(CHEMBL2042695)
Affinity DataIC50:  18nM. Assay description: Inhibition of ALK
In DepthDetails ArticlePubMed
TargetInsulin receptor(Homo sapiens (Human))
TBA
Curated by ChEMBL
LigandPNGBDBM50385594(CHEMBL2042695)
Affinity DataIC50:  91nM. Assay description: Inhibition of insulin receptor
In DepthDetails ArticlePubMed
TargetALK tyrosine kinase receptor(Homo sapiens (Human))
TBA
Curated by ChEMBL
LigandPNGBDBM50385594(CHEMBL2042695)
Affinity DataIC50:  100nM. Assay description: Inhibition of NPM-ALK autophosphorylation in human KARPAS299 cells
In DepthDetails ArticlePubMed