BDBM50385928 CHEMBL2042038
SMILES CC(Oc1cc(ccc1C(N)=O)-c1cc(cnc1N)-c1ccc(CN2CCCCC2)s1)c1ccccc1C(F)(F)F
InChI Key InChIKey=UDRXFTHAAGUSLS-UHFFFAOYSA-N
Data  1 IC50
  Tab Delimited (TSV)   2D SDfile   Computed 3D by Vconf -m prep SDfile
Find this compound or compounds like it in BindingDB:
Activity Spreadsheet -- Enzyme Inhibition Constant Data from BindingDB
Found 1 hit for monomerid = 50385928
TargetSerine/threonine-protein kinase Nek2(Homo sapiens (Human))
The Institute Of Cancer Research
Curated by ChEMBL
LigandPNGBDBM50385928(CHEMBL2042038)
Affinity DataIC50:  93nM. Assay description: Inhibition of Nek2 using 5-FAM-KKLNRTLSVA-COOH as substrate after 1 hr by caliper method
In DepthDetails ArticlePubMed