BDBM50386197 CHEMBL2042812
SMILES COc1cc(O)c2c(OC3=CC(=O)C(C(C)=O)C(=O)[C@@]23C)c1C(=O)NCc1c(C)ccc2cc(F)ccc12
InChI Key InChIKey=ZAJNIFPBORKYJS-GJQLDDCUSA-N
Data  1 EC50
  Tab Delimited (TSV)   2D SDfile   Computed 3D by Vconf -m prep SDfile
Find this compound or compounds like it in BindingDB:
Activity Spreadsheet -- Enzyme Inhibition Constant Data from BindingDB
Found 1 hit for monomerid = 50386197
TargetPeroxisome proliferator-activated receptor gamma(Homo sapiens (Human))
Daiichi Sankyo
Curated by ChEMBL
LigandPNGBDBM50386197(CHEMBL2042812)
Affinity DataEC50:  27nM. Assay description: Modulation of full-length human pSG5-fused PPARgamma expressed in MG-63 cells co-expressing pGV-P2-PPRE after 24 hrs by luciferase reporter gene base...
In DepthDetails ArticlePubMed