BDBM50386253 CHEMBL2040963
SMILES CN(C(=O)[C@@H]1Cc2ccccc2CN1C(=O)Cc1ccc(Cl)cc1)c1ccc(cc1)N1CCCCC1=O
InChI Key InChIKey=MFMDOAGXVGKILM-MHZLTWQESA-N
Data  1 IC50
  Tab Delimited (TSV)   2D SDfile   Computed 3D by Vconf -m prep SDfile
Find this compound or compounds like it in BindingDB:
Activity Spreadsheet -- Enzyme Inhibition Constant Data from BindingDB
Found 1 hit for monomerid = 50386253
TargetCoagulation factor X(Homo sapiens (Human))
Virginia Commonwealth University
Curated by ChEMBL
LigandPNGBDBM50386253(CHEMBL2040963)
Affinity DataIC50:  1.30E+3nM. Assay description: Inhibition of human factor 10a using chromogenic spectrozyme F10a as substrate after 10 mins by spectrophotometry
In DepthDetails ArticlePubMed