BDBM50386361 CHEMBL2048413
SMILES O=C1CCCCN1c1nnc(s1)N1CCC(CC1)N1CCCCC1
InChI Key InChIKey=GTDIJQCEVHTETC-UHFFFAOYSA-N
Data  2 KI
  Tab Delimited (TSV)   2D SDfile   Computed 3D by Vconf -m prep SDfile
Find this compound or compounds like it in BindingDB:
Activity Spreadsheet -- Enzyme Inhibition Constant Data from BindingDB
Found 2 hits for monomerid = 50386361
TargetHistamine H3 receptor(Homo sapiens (Human))
TBA
Curated by ChEMBL
LigandPNGBDBM50386361(CHEMBL2048413)
Affinity DataKi:  120nM. Assay description: Displacement of [3H]-N-alpha-methylhistamine from human recombinant histamine H3 receptor after 30 mins by scintillation counting
In DepthDetails ArticlePubMed
TargetHistamine H3 receptor(Mus musculus)
TBA
Curated by ChEMBL
LigandPNGBDBM50386361(CHEMBL2048413)
Affinity DataKi:  120nM. Assay description: Displacement of [3H]-N-alpha-methylhistamine from mouse recombinant histamine H3 receptor after 30 mins by scintillation counting
In DepthDetails ArticlePubMed