BDBM50386372 CHEMBL2046861
SMILES C[C@H]1C[C@H]2[C@@H](C1)[C@@]2(N1CCN(CC1)c1ccccc1)c1ccc(O)cc1
InChI Key InChIKey=UUWNSUXDHRSBHP-WKJJFCIUSA-N
Data  1 IC50
  Tab Delimited (TSV)   2D SDfile   Computed 3D by Vconf -m prep SDfile
Find this compound or compounds like it in BindingDB:
Activity Spreadsheet -- Enzyme Inhibition Constant Data from BindingDB
Found 1 hit for monomerid = 50386372
TargetNeuropeptide Y receptor type 1(Homo sapiens (Human))
TBA
Curated by ChEMBL
LigandPNGBDBM50386372(CHEMBL2046861)
Affinity DataIC50:  170nM. Assay description: Displacement of [125I]peptideYY from NPY1 receptor in human SK-N-MC cells after 1 hr by scintillation counting
In DepthDetails ArticlePubMed