BDBM50386710 CHEMBL2048793
SMILES OCCn1ccc2ncnc(Nc3ccc(Oc4cccc5C(=O)NCc45)c(Cl)c3)c12
InChI Key InChIKey=LXVWRCNPCFIKGD-UHFFFAOYSA-N
Data  2 IC50
  Tab Delimited (TSV)   2D SDfile   Computed 3D by Vconf -m prep SDfile
Find this compound or compounds like it in BindingDB:
Activity Spreadsheet -- Enzyme Inhibition Constant Data from BindingDB
Found 2 hits for monomerid = 50386710
TargetReceptor tyrosine-protein kinase erbB-2(Homo sapiens (Human))
Takeda Pharmaceutical
Curated by ChEMBL
LigandPNGBDBM50386710(CHEMBL2048793)
Affinity DataIC50:  150nM. Assay description: Inhibition of N-terminus peptide-tagged human recombinant HER2 expressed using baculovirus infection system using [gamma-33P]-ATP preincubated with c...
In DepthDetails ArticlePubMed
TargetEpidermal growth factor receptor(Homo sapiens (Human))
Takeda Pharmaceutical
Curated by ChEMBL
LigandPNGBDBM50386710(CHEMBL2048793)
Affinity DataIC50:  890nM. Assay description: Inhibition of N-terminus peptide-tagged human recombinant EGFR expressed using baculovirus infection system using [gamma-33P]-ATP preincubated with c...
In DepthDetails ArticlePubMed