BDBM50386720 CHEMBL2048922
SMILES CCOc1cccc(CCNC(=O)c2ccc(cc2)S(N)(=O)=O)c1
InChI Key InChIKey=HUTCTQGBOFUZJI-UHFFFAOYSA-N
Data  5 KI
  Tab Delimited (TSV)   2D SDfile   Computed 3D by Vconf -m prep SDfile
Find this compound or compounds like it in BindingDB:
Activity Spreadsheet -- Enzyme Inhibition Constant Data from BindingDB
Found 5 hits for monomerid = 50386720
TargetCarbonic anhydrase 7(Homo sapiens (Human))
Universit£
Curated by ChEMBL
LigandPNGBDBM50386720(CHEMBL2048922)
Affinity DataKi:  4.80nM. Assay description: Inhibition of human recombinant full length CA7-mediated CO2 hydration preincubated for 15 mins by stopped-flow assay
In DepthDetails ArticlePubMed
TargetCarbonic anhydrase 9(Homo sapiens (Human))
Universit£
Curated by ChEMBL
LigandPNGBDBM50386720(CHEMBL2048922)
Affinity DataKi:  8.10nM. Assay description: Inhibition of human recombinant CA9 catalytic domain-mediated CO2 hydration preincubated for 15 mins by stopped-flow assay
In DepthDetails ArticlePubMed
TargetCarbonic anhydrase 14(Homo sapiens (Human))
Universit£
Curated by ChEMBL
LigandPNGBDBM50386720(CHEMBL2048922)
Affinity DataKi:  8.60nM. Assay description: Inhibition of human recombinant full length CA14-mediated CO2 hydration preincubated for 15 mins by stopped-flow assay
In DepthDetails ArticlePubMed
TargetCarbonic anhydrase 2(Homo sapiens (Human))
Universit£
Curated by ChEMBL
LigandPNGBDBM50386720(CHEMBL2048922)
Affinity DataKi:  33nM. Assay description: Inhibition of human recombinant full length CA2-mediated CO2 hydration preincubated for 15 mins by stopped-flow assay
In DepthDetails ArticlePubMed
TargetCarbonic anhydrase 1(Homo sapiens (Human))
Universit£
Curated by ChEMBL
LigandPNGBDBM50386720(CHEMBL2048922)
Affinity DataKi:  514nM. Assay description: Inhibition of human recombinant full length CA1-mediated CO2 hydration preincubated for 15 mins by stopped-flow assay
In DepthDetails ArticlePubMed