BDBM50386884 CHEMBL2048497
SMILES CCc1ccc(Cc2cc(c(OC)cc2OC)[C@]2(O)C[C@H](CO)[C@@H](O)[C@H](O)[C@H]2O)cc1
InChI Key InChIKey=YBDASUYOOMCJRA-ASDZUOGYSA-N
Data  4 IC50
  Tab Delimited (TSV)   2D SDfile   Computed 3D by Vconf -m prep SDfile
Find this compound or compounds like it in BindingDB:
Activity Spreadsheet -- Enzyme Inhibition Constant Data from BindingDB
Found 4 hits for monomerid = 50386884
TargetCytochrome P450 3A4(Homo sapiens (Human))
Chugai Pharmaceutical
Curated by ChEMBL
LigandPNGBDBM50386884(CHEMBL2048497)
Affinity DataIC50: >5.00E+4nM. Assay description: Inhibition of CYP3A4 using BFC substrate in which compound added to reaction mixture before addition of BFC substrate by fluorometric assay
In DepthDetails ArticlePubMed
TargetCytochrome P450 3A4(Homo sapiens (Human))
Chugai Pharmaceutical
Curated by ChEMBL
LigandPNGBDBM50386884(CHEMBL2048497)
Affinity DataIC50:  2.90E+4nM. Assay description: Inhibition of CYP3A4 using BFC substrate in which compound added to reaction mixture simulatenously with BFC substrate by fluorometric assay
In DepthDetails ArticlePubMed
TargetSodium/glucose cotransporter 1(Homo sapiens (Human))
Chugai Pharmaceutical
Curated by ChEMBL
LigandPNGBDBM50386884(CHEMBL2048497)
Affinity DataIC50:  8.60E+3nM. Assay description: Inhibition of human SGLT1 expressed in CHO-K1 cells by [14C]AMG uptake assay
In DepthDetails ArticlePubMed
TargetSodium/glucose cotransporter 2(Homo sapiens (Human))
Chugai Pharmaceutical
Curated by ChEMBL
LigandPNGBDBM50386884(CHEMBL2048497)
Affinity DataIC50:  10nM. Assay description: Inhibition of human SGLT2 expressed in CHO-K1 cells by [14C]AMG uptake assay
In DepthDetails ArticlePubMed