BDBM50386918 CHEMBL2048663
SMILES CCS(=O)(=O)Nc1ccc(CCNC(=O)c2ccnc3nc([nH]c23)-c2ccoc2)cc1
InChI Key InChIKey=NSSKRYTXKRSSHN-UHFFFAOYSA-N
Data  1 IC50  1 EC50
  Tab Delimited (TSV)   2D SDfile   Computed 3D by Vconf -m prep SDfile
Find this compound or compounds like it in BindingDB:
Activity Spreadsheet -- Enzyme Inhibition Constant Data from BindingDB
Found 2 hits for monomerid = 50386918
TargetGlycogen synthase kinase-3 beta(Homo sapiens (Human))
Crystalgenomics
Curated by ChEMBL
LigandPNGBDBM50386918(CHEMBL2048663)
Affinity DataEC50:  290nM. Assay description: Inhibition of GSK3B in human Rd cells
In DepthDetails ArticlePubMed
TargetGlycogen synthase kinase-3 beta(Homo sapiens (Human))
Crystalgenomics
Curated by ChEMBL
LigandPNGBDBM50386918(CHEMBL2048663)
Affinity DataIC50:  1nM. Assay description: Inhibition of human GSK3beta using phospho-CREB as substrate by beta counting method
In DepthDetails ArticlePubMed