BDBM50386922 CHEMBL2048666
SMILES Oc1cccc(CCNC(=O)c2ccnc3nc([nH]c23)-c2ccc(F)cc2)c1
InChI Key InChIKey=UJQFOUYJDYVEIK-UHFFFAOYSA-N
Data  1 IC50  1 EC50
  Tab Delimited (TSV)   2D SDfile   Computed 3D by Vconf -m prep SDfile
Find this compound or compounds like it in BindingDB:
Activity Spreadsheet -- Enzyme Inhibition Constant Data from BindingDB
Found 2 hits for monomerid = 50386922
TargetGlycogen synthase kinase-3 beta(Homo sapiens (Human))
Crystalgenomics
Curated by ChEMBL
LigandPNGBDBM50386922(CHEMBL2048666)
Affinity DataEC50:  150nM. Assay description: Inhibition of GSK3B in human Rd cells
In DepthDetails ArticlePubMed
TargetGlycogen synthase kinase-3 beta(Homo sapiens (Human))
Crystalgenomics
Curated by ChEMBL
LigandPNGBDBM50386922(CHEMBL2048666)
Affinity DataIC50:  14nM. Assay description: Inhibition of human GSK3beta using phospho-CREB as substrate by beta counting method
In DepthDetails ArticlePubMed