BDBM50386939 CHEMBL2048684
SMILES COc1ccncc1NC(=O)c1ccnc2nc([nH]c12)-c1cccc(Cl)c1
InChI Key InChIKey=INWNNIGJNOJZRV-UHFFFAOYSA-N
Data  1 IC50  1 EC50
  Tab Delimited (TSV)   2D SDfile   Computed 3D by Vconf -m prep SDfile
Find this compound or compounds like it in BindingDB:
Activity Spreadsheet -- Enzyme Inhibition Constant Data from BindingDB
Found 2 hits for monomerid = 50386939
TargetGlycogen synthase kinase-3 beta(Homo sapiens (Human))
Crystalgenomics
Curated by ChEMBL
LigandPNGBDBM50386939(CHEMBL2048684)
Affinity DataEC50:  10nM. Assay description: Inhibition of GSK3B in human Rd cells
In DepthDetails ArticlePubMed
TargetGlycogen synthase kinase-3 beta(Homo sapiens (Human))
Crystalgenomics
Curated by ChEMBL
LigandPNGBDBM50386939(CHEMBL2048684)
Affinity DataIC50:  2nM. Assay description: Inhibition of human GSK3beta using phospho-CREB as substrate by beta counting method
In DepthDetails ArticlePubMed