BDBM50386954 CHEMBL2048819
SMILES Cc1cn2cc(CC(=O)N3CCC4(CN(Cc5ccc(cc5)-n5nccn5)C4)CC3)nc2s1
InChI Key InChIKey=XMMNYPRUXVXHJM-UHFFFAOYSA-N
Data  1 KI  1 IC50
  Tab Delimited (TSV)   2D SDfile   Computed 3D by Vconf -m prep SDfile
Find this compound or compounds like it in BindingDB:
Activity Spreadsheet -- Enzyme Inhibition Constant Data from BindingDB
Found 2 hits for monomerid = 50386954
TargetGrowth hormone secretagogue receptor type 1(Homo sapiens (Human))
Pfizer
Curated by ChEMBL
LigandPNGBDBM50386954(CHEMBL2048819)
Affinity DataKi:  69nM. Assay description: Antagonist activity at human GHS-R1a expressed in HEK293 cells assessed as inhibition of ghrelin-induced europium-labeled GTP binding by DELFIA
In DepthDetails ArticlePubMed
TargetGrowth hormone secretagogue receptor type 1(Homo sapiens (Human))
Pfizer
Curated by ChEMBL
LigandPNGBDBM50386954(CHEMBL2048819)
Affinity DataIC50:  25nM. Assay description: Displacement of [125I]Ghrelin from human GHS-R1a expressed in HEK293 cells after 8 hrs by SPA
In DepthDetails ArticlePubMed