BDBM50387072 CHEMBL2047062
SMILES NC(=O)c1nccc2c3cc(ccc3[nH]c12)S(=O)(=O)NCC(O)CO
InChI Key InChIKey=ISNLRLPZWXJDSI-UHFFFAOYSA-N
Data  1 IC50
  Tab Delimited (TSV)   2D SDfile   Computed 3D by Vconf -m prep SDfile
Find this compound or compounds like it in BindingDB:
Activity Spreadsheet -- Enzyme Inhibition Constant Data from BindingDB
Found 1 hit for monomerid = 50387072
TargetSerine/threonine-protein kinase B-raf(Homo sapiens (Human))
China Pharmaceutical University
Curated by ChEMBL
LigandPNGBDBM50387072(CHEMBL2047062)
Affinity DataIC50:  4.51E+4nM. Assay description: Inhibition of human wild type B-Raf kinase assessed as change in ATP consumption by luciferase-luiferin-coupled chemiluminescent assay
In DepthDetails ArticlePubMed