BDBM50387097 CHEMBL2047226
SMILES Brc1ccc(CNc2ccnc(NC3CCN(Cc4ccccc4)CC3)n2)cc1
InChI Key InChIKey=WOAVNWHCIXCOIZ-UHFFFAOYSA-N
Data  2 IC50
  Tab Delimited (TSV)   2D SDfile   Computed 3D by Vconf -m prep SDfile
Find this compound or compounds like it in BindingDB:
Activity Spreadsheet -- Enzyme Inhibition Constant Data from BindingDB
Found 2 hits for monomerid = 50387097
TargetAcetylcholinesterase(Homo sapiens (Human))
University Of Waterloo
Curated by ChEMBL
LigandPNGBDBM50387097(CHEMBL2047226)
Affinity DataIC50:  9.90E+3nM. Assay description: Inhibition of human AChE using acetylthiocholine iodide as substrate after 5 mins by DTNB method
In DepthDetails ArticlePubMed
TargetCholinesterase(Equus caballus (Horse))
University Of Waterloo
Curated by ChEMBL
LigandPNGBDBM50387097(CHEMBL2047226)
Affinity DataIC50:  4.10E+3nM. Assay description: Inhibition of equine BuChE using butyrylthiocholine iodide as substrate after 5 mins by DTNB method
In DepthDetails ArticlePubMed