BDBM50387354 CHEMBL2046651
SMILES CC(C)C[C@H]1CN(CCN1)c1cc(C)cc(n1)C(=O)c1cccnc1N
InChI Key InChIKey=YOSWNJPQIDFLAM-HNNXBMFYSA-N
Data  3 KI  1 IC50
  Tab Delimited (TSV)   2D SDfile   Computed 3D by Vconf -m prep SDfile
Find this compound or compounds like it in BindingDB:
Activity Spreadsheet -- Enzyme Inhibition Constant Data from BindingDB
Found 4 hits for monomerid = 50387354
TargetProtein kinase C theta type(Homo sapiens (Human))
Vertex Pharmaceuticals
Curated by ChEMBL
LigandPNGBDBM50387354(CHEMBL2046651)
Affinity DataKi:  24nM. Assay description: Inhibition of PKCtheta
In DepthDetails ArticlePubMed
TargetProtein kinase C delta type(Homo sapiens (Human))
Vertex Pharmaceuticals
Curated by ChEMBL
LigandPNGBDBM50387354(CHEMBL2046651)
Affinity DataKi:  116nM. Assay description: Inhibition of PKCdelta
In DepthDetails ArticlePubMed
TargetProtein kinase C alpha type(Homo sapiens (Human))
Vertex Pharmaceuticals
Curated by ChEMBL
LigandPNGBDBM50387354(CHEMBL2046651)
Affinity DataKi:  459nM. Assay description: Inhibition of PKCalpha
In DepthDetails ArticlePubMed
TargetProtein kinase C theta type(Homo sapiens (Human))
Vertex Pharmaceuticals
Curated by ChEMBL
LigandPNGBDBM50387354(CHEMBL2046651)
Affinity DataIC50:  410nM. Assay description: Inhibition of PKCtheta-mediated IL-2 production by cell based assay
In DepthDetails ArticlePubMed