BDBM50387377 CHEMBL2047090
SMILES Cc1ccc(cc1)-c1oc2ccc(OCc3cccc(c3)-c3ccccc3)cc2c1C(O)=O
InChI Key InChIKey=SUEHUIBEJCDAEK-UHFFFAOYSA-N
Data  1 IC50
  Tab Delimited (TSV)   2D SDfile   Computed 3D by Vconf -m prep SDfile
Find this compound or compounds like it in BindingDB:
Activity Spreadsheet -- Enzyme Inhibition Constant Data from BindingDB
Found 1 hit for monomerid = 50387377
TargetAnoctamin-1(Homo sapiens (Human))
Kurukshetra University
Curated by ChEMBL
LigandPNGBDBM50387377(CHEMBL2047090)
Affinity DataIC50:  1.63E+4nM. Assay description: Inhibition of human TMEM16A transfected in FRT cells assessed as iodide influx using YFP-F46L/H148Q/I152L halide sensor after 10 mins by spectrofluor...
In DepthDetails ArticlePubMed