BDBM50387431 CHEMBL2047444
SMILES CN[C@@H]1CCN(C1)C(=O)c1cc2cccc(C)c2[nH]1
InChI Key InChIKey=AEPVGIPVZCQCFW-GFCCVEGCSA-N
Data  1 KI
  Tab Delimited (TSV)   2D SDfile   Computed 3D by Vconf -m prep SDfile
Find this compound or compounds like it in BindingDB:
Activity Spreadsheet -- Enzyme Inhibition Constant Data from BindingDB
Found 1 hit for monomerid = 50387431
TargetHistamine H4 receptor(Homo sapiens (Human))
Boehringer Ingelheim Rcv
Curated by ChEMBL
LigandPNGBDBM50387431(CHEMBL2047444)
Affinity DataKi:  631nM. Assay description: Displacement of [3H]histamine from human histamine H4 receptor expressed in HEK cells
In DepthDetails ArticlePubMed