BDBM50387441 CHEMBL2047456
SMILES CN1CCCN(CC1)C(=O)c1cc2ccccc2[nH]1
InChI Key InChIKey=JEAOOJVVTOKESY-UHFFFAOYSA-N
Data  1 KI
  Tab Delimited (TSV)   2D SDfile   Computed 3D by Vconf -m prep SDfile
Find this compound or compounds like it in BindingDB:
Activity Spreadsheet -- Enzyme Inhibition Constant Data from BindingDB
Found 1 hit for monomerid = 50387441
TargetHistamine H4 receptor(Homo sapiens (Human))
Boehringer Ingelheim Rcv
Curated by ChEMBL
LigandPNGBDBM50387441(CHEMBL2047456)
Affinity DataKi:  398nM. Assay description: Displacement of [3H]histamine from human histamine H4 receptor expressed in HEK cells
In DepthDetails ArticlePubMed