BDBM50387470 CHEMBL1437043
SMILES COc1ccc2cc([nH]c2c1)C(=O)N1CCN(C)CC1
InChI Key InChIKey=VZSXALSSTLGZGH-UHFFFAOYSA-N
Data  1 KI
  Tab Delimited (TSV)   2D SDfile   Computed 3D by Vconf -m prep SDfile
Find this compound or compounds like it in BindingDB:
Activity Spreadsheet -- Enzyme Inhibition Constant Data from BindingDB
Found 1 hit for monomerid = 50387470
TargetHistamine H4 receptor(Homo sapiens (Human))
Boehringer Ingelheim Rcv
Curated by ChEMBL
LigandPNGBDBM50387470(CHEMBL1437043)
Affinity DataKi:  1.58E+4nM. Assay description: Displacement of [3H]histamine from human histamine H4 receptor expressed in HEK cells
In DepthDetails ArticlePubMed