BDBM50387529 CHEMBL2059909
SMILES CC(C)(C)NS(=O)(=O)c1cncc(c1)-c1ccc2nc(N)nn2c1
InChI Key InChIKey=YKJGGEMOMSRCDT-UHFFFAOYSA-N
Data  9 IC50
  Tab Delimited (TSV)   2D SDfile   Computed 3D by Vconf -m prep SDfile
Find this compound or compounds like it in BindingDB:
Activity Spreadsheet -- Enzyme Inhibition Constant Data from BindingDB
Found 9 hits for monomerid = 50387529
LigandPNGBDBM50387529(CHEMBL2059909)
Affinity DataIC50:  25.1nM. Assay description: Inhibition of PI3Kgamma by high throughput chemoproteomics binding assay
In DepthDetails ArticlePubMed
LigandPNGBDBM50387529(CHEMBL2059909)
Affinity DataIC50:  1.58E+3nM. Assay description: Inhibition of PI3Kdelta by high throughput chemoproteomics binding assay
In DepthDetails ArticlePubMed
LigandPNGBDBM50387529(CHEMBL2059909)
Affinity DataIC50:  2.00E+3nM. Assay description: Inhibition of PI3Kgamma assessed as inhibition of C5a-induced AKT phosphorylation at Ser473 by cell based assay
In DepthDetails ArticlePubMed
LigandPNGBDBM50387529(CHEMBL2059909)
Affinity DataIC50:  1.00E+3nM. Assay description: Inhibition of PI3Kgamma assessed as inhibition of fMLP-induced neutrophil migration assay by cell based assay
In DepthDetails ArticlePubMed
LigandPNGBDBM50387529(CHEMBL2059909)
Affinity DataIC50:  2.51E+3nM. Assay description: Inhibition of PI3Kalpha in human HL60 cell lysate by kinobead assay
In DepthDetails ArticlePubMed
LigandPNGBDBM50387529(CHEMBL2059909)
Affinity DataIC50:  25.1nM. Assay description: Inhibition of PI3Kgamma in human HL60 cell lysate by kinobead assay
In DepthDetails ArticlePubMed
LigandPNGBDBM50387529(CHEMBL2059909)
Affinity DataIC50:  1.58E+3nM. Assay description: Inhibition of PI3Kdelta in human HL60 cell lysate by kinobead assay
In DepthDetails ArticlePubMed
LigandPNGBDBM50387529(CHEMBL2059909)
Affinity DataIC50:  200nM. Assay description: Inhibition of PI3Kbeta in human HL60 cell lysate by kinobead assay
In DepthDetails ArticlePubMed
LigandPNGBDBM50387529(CHEMBL2059909)
Affinity DataIC50:  2.51E+3nM. Assay description: Inhibition of PI3Kalpha by high throughput chemoproteomics binding assay
In DepthDetails ArticlePubMed